{"text_format":"1","workbook":"xlsx","n_sheets":3,"sheets":["Sheet1","Sheet2","Sheet3"],"not_rendered":{"charts":0,"images":1,"macros":1,"external_links":0,"defined_names":1,"comments":0,"pivot_tables":0},"unopened":[],"bounds":{"document_bytes":16777216,"sheet_cells":100000,"rows_first":2000,"rows_last":500,"rows_between":2000,"halvings":0,"cell_chars":16384,"cell_head_chars":4096},"cells_cut":0,"cells_raw":0,"read":"whole","date_system":"1900"}

{"sheet":"Sheet1","index":0,"n_rows":361,"n_cols":198,"rows_kept":361,"cut":false,"hidden":false,"merged":[[22,41,23,59],[70,11,71,21],[70,22,71,39],[67,40,71,41],[70,42,71,45],[67,63,70,70],[71,63,74,70],[69,71,70,79],[71,71,71,79],[72,71,74,79],[67,80,70,88],[71,80,74,88],[69,89,70,97],[71,89,71,97],[72,89,74,97],[67,71,68,79],[67,89,68,97],[41,75,42,97],[41,10,42,26],[20,22,23,40],[36,11,37,15],[34,16,35,19],[36,20,37,33],[67,11,69,21],[55,46,58,52],[72,44,74,45],[31,20,32,33],[341,102,359,106],[306,4,339,5],[306,2,340,3],[8,112,11,196],[12,112,15,196],[20,124,24,197],[25,124,28,196],[29,112,32,196],[97,112,100,196],[101,112,102,196],[38,112,40,196],[42,112,45,196],[46,112,49,196],[60,112,62,195],[63,112,65,196],[66,112,69,196],[349,108,357,109],[350,121,355,198],[351,111,352,120],[353,111,354,120],[356,111,359,120],[356,121,359,167],[356,168,359,174],[356,175,359,198],[346,107,346,110],[346,111,346,114],[346,115,346,118],[346,119,346,122],[346,123,346,126],[346,127,346,130],[346,131,346,134],[20,41,21,59],[360,107,361,116],[360,117,361,118],[360,119,361,120],[360,121,361,122],[360,123,361,124],[360,125,361,126],[360,127,361,136],[360,137,361,138],[360,139,361,140],[360,141,361,142],[360,143,361,144],[360,145,361,146],[360,147,361,148],[360,149,361,150],[360,151,361,152],[346,164,346,167],[319,112,321,146],[325,112,327,146],[337,112,339,146],[331,112,333,146],[347,111,349,198],[346,184,346,188],[346,189,346,193],[343,184,345,188],[343,189,345,193],[346,194,346,198],[346,135,346,138],[346,139,346,142],[346,143,346,146],[346,151,346,153],[346,154,346,156],[346,157,346,159],[346,160,346,163],[340,123,345,126],[340,127,341,134],[340,143,345,146],[340,151,342,167],[342,127,345,130],[342,131,345,134],[343,151,345,153],[343,154,345,156],[343,157,345,159],[343,160,345,163],[343,164,345,167],[343,194,345,198],[340,168,342,198],[334,110,339,111],[334,112,335,122],[334,123,335,140],[334,141,336,142],[334,143,335,146],[334,150,339,151],[334,152,335,162],[334,163,335,180],[334,181,336,182],[334,183,335,186],[336,112,336,122],[336,123,336,140],[336,143,336,146],[336,152,336,162],[336,163,336,180],[336,183,336,186],[337,152,339,186],[340,107,345,110],[340,111,345,114],[340,115,345,118],[340,119,345,122],[322,181,324,182],[322,183,323,186],[324,101,339,106],[324,112,324,122],[324,123,324,140],[324,143,324,146],[324,152,324,162],[324,163,324,180],[324,183,324,186],[316,107,339,109],[316,110,321,111],[316,112,317,122],[316,123,317,140],[316,141,318,142],[316,143,317,146],[316,147,339,149],[316,150,321,151],[316,152,317,162],[316,163,317,180],[316,181,318,182],[316,183,317,186],[318,112,318,122],[318,123,318,140],[325,152,327,186],[328,110,333,111],[328,112,329,122],[328,123,329,140],[328,141,330,142],[328,143,329,146],[328,150,333,151],[328,152,329,162],[328,163,329,180],[318,143,318,146],[318,152,318,162],[318,163,318,180],[318,183,318,186],[308,107,315,111],[308,112,310,122],[308,123,310,140],[308,147,315,153],[308,154,310,163],[311,154,315,163],[313,112,315,146],[316,187,339,198],[319,152,321,186],[322,110,327,111],[322,112,323,122],[322,123,323,140],[322,141,324,142],[322,143,323,146],[322,150,327,151],[328,181,330,182],[328,183,329,186],[330,112,330,122],[330,123,330,140],[330,143,330,146],[330,152,330,162],[330,163,330,180],[330,183,330,186],[331,152,333,186],[322,152,323,162],[322,163,323,180],[300,107,307,112],[300,113,303,119],[300,120,303,129],[300,130,303,136],[300,137,300,143],[300,144,300,148],[300,149,300,153],[300,154,303,163],[300,164,303,170],[300,171,303,180],[300,181,303,196],[300,197,303,198],[301,137,303,143],[301,144,303,148],[301,149,303,153],[304,113,307,119],[304,120,304,129],[304,130,307,136],[304,137,304,143],[304,144,304,148],[304,149,304,153],[304,154,307,163],[304,164,307,170],[304,171,307,180],[304,181,307,196],[305,120,307,129],[305,137,307,143],[305,144,307,148],[305,149,307,153],[311,112,312,122],[311,123,312,140],[280,107,281,129],[280,130,281,152],[280,153,281,175],[280,176,281,198],[282,107,283,110],[282,111,283,127],[282,128,283,129],[282,130,283,152],[282,153,283,175],[282,176,283,198],[284,107,286,129],[284,130,286,152],[284,153,286,175],[284,176,286,198],[289,107,295,198],[296,107,299,112],[296,113,299,119],[296,120,296,129],[296,130,299,136],[296,137,296,146],[296,147,299,153],[296,154,296,163],[296,164,299,170],[296,171,296,180],[296,181,299,187],[296,188,296,198],[297,120,299,129],[297,137,299,146],[297,154,299,163],[297,171,299,180],[297,188,299,198],[277,107,278,111],[277,112,278,116],[277,117,278,120],[277,121,278,134],[277,135,278,139],[277,140,278,143],[277,144,278,147],[277,148,278,152],[277,153,278,156],[277,157,278,161],[277,162,278,165],[277,166,278,174],[277,175,278,180],[277,181,278,186],[277,187,278,192],[277,193,278,198],[279,107,279,111],[279,112,279,116],[279,117,279,120],[279,121,279,134],[279,135,279,139],[279,140,279,143],[279,144,279,147],[279,148,279,152],[279,153,279,156],[279,157,279,161],[279,162,279,165],[279,166,279,174],[279,175,279,180],[279,181,279,186],[279,187,279,192],[279,193,279,198],[271,107,272,120],[271,193,272,198],[273,107,274,120],[273,139,274,161],[273,193,274,198],[275,117,276,120],[275,135,276,143],[275,144,276,156],[275,157,276,165],[275,175,276,186],[275,187,276,192],[275,193,276,198],[271,135,272,165],[271,166,272,174],[271,175,272,192],[272,121,273,134],[273,166,274,174],[273,175,274,192],[274,121,275,134],[275,166,276,174],[261,107,264,122],[261,123,264,141],[261,161,264,179],[261,180,264,198],[265,107,270,122],[265,123,266,126],[265,127,266,139],[265,140,266,141],[265,142,266,160],[265,161,266,179],[265,180,266,181],[265,182,266,196],[265,197,266,198],[267,123,270,141],[267,142,270,160],[267,161,270,179],[267,180,270,198],[261,142,262,160],[263,142,264,160],[247,113,260,116],[247,117,260,159],[247,160,248,170],[247,171,248,198],[252,160,254,169],[252,170,254,198],[254,107,255,112],[255,160,260,163],[255,164,256,171],[255,172,256,198],[257,164,260,198],[225,194,225,198],[226,111,228,120],[226,121,228,122],[226,123,228,124],[226,125,228,126],[226,127,228,128],[226,129,228,130],[239,107,240,198],[249,160,251,198],[247,107,252,112],[257,107,260,112],[225,107,225,110],[225,111,225,114],[230,111,231,120],[232,111,233,120],[226,131,228,132],[226,133,228,134],[226,135,228,136],[226,137,228,138],[226,139,228,140],[226,141,228,142],[226,143,228,144],[226,145,228,146],[226,147,228,198],[222,184,224,188],[222,189,224,193],[222,194,224,198],[225,184,225,188],[225,189,225,193],[242,100,246,105],[242,107,246,198],[218,102,238,106],[228,108,236,109],[235,111,238,120],[235,121,238,167],[235,168,238,174],[235,175,238,198],[219,107,224,110],[219,111,224,114],[219,115,224,118],[219,119,224,122],[219,123,224,126],[219,127,220,134],[219,143,224,146],[219,151,221,167],[219,168,221,198],[221,127,224,130],[221,131,224,134],[222,151,224,153],[222,154,224,156],[225,115,225,118],[225,119,225,122],[225,123,225,126],[225,127,225,130],[225,131,225,134],[225,135,225,138],[225,139,225,142],[225,143,225,146],[225,151,225,153],[225,154,225,156],[225,157,225,159],[225,160,225,163],[225,164,225,167],[229,121,234,198],[195,107,218,109],[210,183,212,184],[210,185,212,186],[210,187,218,198],[216,167,218,168],[216,169,218,170],[216,171,218,172],[216,173,218,174],[213,110,218,111],[213,112,214,122],[213,123,214,140],[213,141,215,142],[213,143,214,146],[213,150,218,151],[213,152,214,162],[213,163,214,180],[222,157,224,159],[222,160,224,163],[222,164,224,167],[213,181,215,182],[213,183,214,186],[215,112,215,122],[215,123,215,140],[215,143,215,146],[215,152,215,162],[215,163,215,180],[215,183,215,186],[216,112,218,122],[216,123,218,124],[216,125,218,126],[216,127,218,128],[216,129,218,130],[216,131,218,132],[216,133,218,134],[216,135,218,136],[216,137,218,138],[216,139,218,140],[216,141,218,142],[216,143,218,144],[216,145,218,146],[216,152,218,162],[216,163,218,164],[216,165,218,166],[216,175,218,176],[216,177,218,178],[216,179,218,180],[216,181,218,182],[216,183,218,184],[216,185,218,186],[209,187,209,198],[210,112,212,122],[210,123,212,124],[210,125,212,126],[210,127,212,128],[210,129,212,130],[210,131,212,132],[210,133,212,134],[210,135,212,136],[210,137,212,138],[210,139,212,140],[210,141,212,142],[210,143,212,144],[210,145,212,146],[210,152,212,162],[210,163,212,164],[210,165,212,166],[210,167,212,168],[210,169,212,170],[210,171,212,172],[210,173,212,174],[210,175,212,176],[210,177,212,178],[210,179,212,180],[210,181,212,182],[207,110,212,111],[207,112,208,122],[207,123,208,140],[207,141,209,142],[207,143,208,146],[207,150,212,151],[207,152,208,162],[207,163,208,180],[207,181,209,182],[207,183,208,186],[209,112,209,122],[209,123,209,140],[209,143,209,146],[209,152,209,162],[209,163,209,180],[209,183,209,186],[204,125,206,126],[204,127,206,128],[204,129,206,130],[204,131,206,132],[204,133,206,134],[204,135,206,136],[204,137,206,138],[204,139,206,140],[204,141,206,142],[201,110,206,111],[201,112,202,122],[201,123,202,140],[201,141,203,142],[201,143,202,146],[201,150,206,151],[201,181,203,182],[201,183,202,186],[203,112,203,122],[203,123,203,140],[203,143,203,146],[203,152,203,162],[203,163,203,180],[203,183,203,186],[204,112,206,122],[204,123,206,124],[204,143,206,144],[204,145,206,146],[204,152,206,162],[204,163,206,164],[204,165,206,166],[204,167,206,168],[204,169,206,170],[204,171,206,172],[204,173,206,174],[204,175,206,176],[204,177,206,178],[204,179,206,180],[204,181,206,182],[204,183,206,184],[204,185,206,186],[195,110,200,111],[195,112,196,122],[195,123,196,140],[195,141,197,142],[195,143,196,146],[195,147,218,149],[195,150,200,151],[195,152,196,162],[195,163,196,180],[195,181,197,182],[195,183,196,186],[195,187,197,198],[197,112,197,122],[197,123,197,140],[197,143,197,146],[197,152,197,162],[197,163,197,180],[197,183,197,186],[198,112,200,122],[198,123,200,124],[198,125,200,126],[198,127,200,128],[198,129,200,130],[198,131,200,132],[198,133,200,134],[198,135,200,136],[198,137,200,138],[198,139,200,140],[198,141,200,142],[198,143,200,144],[198,145,200,146],[198,179,200,180],[187,107,194,111],[187,112,189,122],[187,123,189,140],[187,147,194,153],[187,154,189,163],[190,154,194,163],[192,112,194,122],[192,123,194,124],[192,125,194,126],[192,127,194,128],[192,129,194,130],[192,131,194,132],[192,133,194,134],[192,135,194,136],[192,137,194,138],[192,139,194,140],[192,141,194,142],[192,143,194,144],[192,145,194,146],[190,112,191,122],[190,123,191,140],[187,141,191,142],[187,143,191,146],[179,107,186,112],[179,113,182,119],[179,120,182,129],[179,130,182,136],[179,137,179,143],[179,144,179,148],[179,149,179,153],[179,154,182,163],[179,164,182,170],[179,171,182,180],[179,181,182,196],[179,197,182,198],[180,137,182,143],[180,144,182,148],[180,149,182,153],[183,113,186,119],[183,120,183,129],[183,130,186,136],[183,137,183,143],[183,144,183,148],[183,149,183,153],[183,154,186,163],[183,164,186,170],[183,171,186,180],[183,181,186,196],[184,120,186,129],[184,137,186,143],[184,144,186,148],[184,149,186,153],[159,107,160,129],[159,130,160,152],[159,153,160,175],[159,176,160,198],[161,107,162,110],[161,111,162,127],[161,128,162,129],[161,130,162,152],[161,153,162,175],[161,176,162,198],[163,107,165,129],[163,130,165,152],[163,153,165,175],[163,176,165,198],[166,107,167,115],[168,107,174,198],[175,107,178,112],[175,113,178,119],[175,120,175,129],[175,130,178,136],[175,137,175,146],[175,147,178,153],[175,154,175,163],[175,164,178,170],[175,171,175,180],[175,181,178,187],[175,188,175,198],[176,120,178,129],[176,137,178,146],[176,154,178,163],[176,171,178,180],[176,188,178,198],[156,107,157,111],[156,112,157,116],[156,117,157,120],[156,121,157,134],[156,135,157,139],[156,140,157,143],[156,144,157,147],[156,148,157,152],[156,153,157,156],[156,157,157,161],[156,162,157,165],[156,166,157,174],[156,175,157,180],[156,181,157,186],[156,187,157,192],[156,193,157,198],[158,107,158,111],[158,112,158,116],[158,117,158,120],[158,121,158,134],[158,135,158,139],[158,140,158,143],[158,144,158,147],[158,148,158,152],[158,153,158,156],[158,157,158,161],[158,162,158,165],[158,166,158,174],[158,175,158,180],[158,181,158,186],[158,187,158,192],[158,193,158,198],[150,107,151,120],[150,193,151,198],[152,107,153,120],[152,139,153,161],[152,193,153,198],[154,117,155,120],[154,135,155,143],[154,144,155,156],[154,157,155,165],[154,175,155,186],[154,187,155,192],[154,193,155,198],[150,135,151,165],[150,166,151,174],[150,175,151,192],[151,121,152,134],[152,166,153,174],[152,175,153,192],[153,121,154,134],[154,166,155,174],[134,160,139,163],[134,164,135,171],[134,172,135,198],[136,164,139,198],[126,107,131,112],[136,107,139,112],[140,107,143,122],[140,123,143,141],[140,161,143,179],[140,180,143,198],[144,107,149,122],[144,123,145,126],[144,127,145,139],[144,140,145,141],[144,142,145,160],[144,161,145,179],[144,180,145,181],[144,182,145,196],[144,197,145,198],[146,123,149,141],[146,142,149,160],[146,161,149,179],[146,180,149,198],[140,142,141,160],[142,142,143,160],[112,10,113,19],[115,20,118,66],[106,34,108,35],[70,53,74,62],[78,84,80,85],[87,62,88,79],[84,34,86,35],[109,20,114,97],[96,72,98,73],[78,32,80,33],[126,113,127,120],[126,121,127,159],[126,160,127,170],[126,171,127,198],[128,113,139,116],[128,117,139,159],[128,160,130,174],[128,175,130,176],[128,177,130,178],[128,179,130,180],[128,181,130,182],[128,183,130,184],[128,185,130,186],[128,187,130,188],[128,189,130,190],[128,191,130,192],[128,193,130,194],[128,195,130,196],[128,197,130,198],[131,160,133,169],[131,170,133,198],[133,107,134,112],[3,36,5,37],[3,38,5,39],[349,7,357,8],[350,20,355,97],[351,10,352,19],[353,10,354,19],[356,10,359,19],[356,20,359,66],[356,67,359,73],[356,74,359,97],[20,112,24,123],[25,112,28,123],[121,100,125,105],[121,107,122,140],[121,141,122,159],[121,160,122,184],[121,185,122,198],[123,141,125,159],[123,160,125,184],[123,185,125,198],[94,112,96,196],[99,42,104,45],[119,6,119,97],[115,74,118,97],[106,32,108,33],[96,51,98,61],[93,49,98,50],[96,70,98,71],[106,46,108,97],[105,50,105,52],[108,7,116,8],[110,10,111,19],[346,6,346,9],[346,10,346,13],[346,14,346,17],[346,18,346,21],[346,22,346,25],[346,26,346,29],[346,30,346,33],[346,34,346,37],[346,38,346,41],[340,6,345,9],[341,2,361,5],[3,59,5,83],[24,60,25,78],[26,79,29,97],[26,60,29,78],[24,41,25,59],[26,41,29,59],[3,6,5,7],[3,8,5,9],[3,10,5,11],[3,12,5,13],[3,14,5,15],[3,16,5,17],[3,18,5,19],[3,20,5,21],[3,22,5,23],[3,24,5,25],[3,26,5,27],[3,28,5,29],[3,30,5,31],[3,32,5,33],[3,34,5,35],[347,36,349,37],[347,38,349,39],[347,40,349,41],[347,42,349,43],[347,44,349,45],[347,46,349,97],[346,42,346,45],[343,83,345,87],[343,88,345,92],[343,93,345,97],[343,50,345,52],[343,53,345,55],[343,56,345,58],[343,59,345,62],[343,63,345,66],[347,10,349,19],[347,20,349,21],[347,22,349,23],[347,24,349,25],[347,26,349,27],[347,28,349,29],[347,30,349,31],[347,32,349,33],[347,34,349,35],[330,42,330,45],[330,51,330,61],[330,62,330,79],[330,82,330,85],[340,10,345,13],[340,14,345,17],[340,18,345,21],[340,22,345,25],[340,26,341,33],[340,50,342,66],[340,67,342,97],[346,83,346,87],[346,88,346,92],[346,93,346,97],[346,50,346,52],[346,53,346,55],[346,56,346,58],[346,59,346,62],[346,63,346,66],[342,26,345,29],[342,30,345,33],[340,42,345,45],[337,38,339,39],[337,40,339,41],[334,9,339,10],[334,11,335,21],[334,22,335,39],[334,40,336,41],[334,42,335,45],[334,49,339,50],[334,51,335,61],[334,62,335,79],[334,80,336,81],[334,82,335,85],[337,11,339,21],[337,22,339,23],[337,24,339,25],[337,26,339,27],[337,28,339,29],[337,30,339,31],[337,32,339,33],[337,34,339,35],[337,36,339,37],[336,11,336,21],[336,22,336,39],[336,42,336,45],[336,51,336,61],[336,62,336,79],[336,82,336,85],[337,42,339,43],[337,44,339,45],[324,82,324,85],[325,11,327,21],[325,22,327,23],[325,24,327,25],[325,26,327,27],[325,28,327,29],[331,36,333,37],[331,38,333,39],[331,40,333,41],[331,42,333,43],[328,9,333,10],[328,11,329,21],[328,22,329,39],[328,40,330,41],[328,42,329,45],[328,49,333,50],[328,51,329,61],[328,62,329,79],[328,80,330,81],[328,82,329,85],[330,11,330,21],[330,22,330,39],[331,11,333,21],[331,22,333,23],[331,24,333,25],[331,26,333,27],[331,28,333,29],[331,30,333,31],[331,32,333,33],[331,34,333,35],[331,44,333,45],[322,9,327,10],[316,80,318,81],[316,82,317,85],[311,53,315,62],[313,11,315,21],[313,22,315,23],[313,24,315,25],[313,26,315,27],[313,28,315,29],[313,30,315,31],[313,32,315,33],[313,34,315,35],[316,86,317,97],[318,86,329,97],[322,11,323,21],[322,22,323,39],[322,40,324,41],[322,42,323,45],[322,49,327,50],[322,51,323,61],[322,62,323,79],[322,80,324,81],[322,82,323,85],[325,30,327,31],[325,32,327,33],[325,34,327,35],[325,36,327,37],[325,38,327,39],[325,40,327,41],[325,42,327,43],[325,44,327,45],[324,11,324,21],[324,22,324,39],[308,6,315,10],[308,11,310,21],[308,22,310,39],[308,46,315,52],[308,53,310,62],[313,36,315,37],[313,38,315,39],[313,40,315,41],[313,42,315,43],[313,44,315,45],[316,6,339,8],[316,9,321,10],[316,11,317,21],[316,22,317,39],[316,40,318,41],[316,42,317,45],[316,46,339,48],[316,49,321,50],[316,51,317,61],[319,28,321,29],[319,30,321,31],[319,32,321,33],[319,34,321,35],[319,36,321,37],[319,38,321,39],[319,40,321,41],[319,24,321,25],[319,26,321,27],[316,62,317,79],[324,42,324,45],[324,51,324,61],[324,62,324,79],[300,6,307,11],[300,12,303,18],[300,19,303,28],[300,29,303,35],[300,36,300,42],[300,43,300,47],[300,48,300,52],[300,53,303,62],[300,63,303,69],[304,12,307,18],[304,19,304,28],[304,29,307,35],[304,36,304,42],[304,43,304,47]],"merged_total":2093,"flags":["merged_cut"]}
[]
[null,null,null,null,null,null,"※",null,null,null,null,null,null,null,null,null,null,null,null,null,null,null,null,null,null,null,null,null,null,null,null,null,null,null,null,null,null,null,null,null,"※　　　種　　　別",null,null,null,null,null,null,null,null,null,null,null,null,null,null,null,null,null,null,"※　　　　　　　整　理　番　号",null,null,null,null,null,null,null,null,null,null,null,null,null,null,null,null,null,null,null,null,null,null,null,null,"※"]
[]
[null,null,null,null,null,null,null,null,null,null,null,null,null,null,null,null,null,null,null,null,null,null,null,null,null,null,null,null,null,null,null,null,null,null,null,null,null,null,null,null,null,null,null,null,null,null,null,null,null,null,null,null,null,null,null,null,null,null,null,null,null,null,null,null,null,null,null,null,null,null,null,null,null,null,null,null,null,null,null,null,null,null,null,null,null,null,null,null,null,null,null,null,null,null,null,null,null,null,null,null,null,null,null,null,null,null,null,null,null,null,null,null,"給与支払報告書・源泉徴収票作成シート入力上の注意"]
[]
[]
[null,null,null,null,null,null,"支　払",null,null,null,null,null,"※区分",null,null,null,null,null,null,null,null,null,null,null,null,null,null,null,null,null,null,null,null,null,null,null,null,null,null,null,null,null,null,null,null,null,null,null,null,null,null,null,null,null,null,null,null,null,null,"(受給者番号)"]
[]
[null,null,null,null,null,null,null,null,null,null,null,null,"住 所",null,null,null,null,null,null,null,null,null,null,null,null,null,null,null,null,null,null,null,null,null,null,null,null,null,null,null,null,null,null,null,null,null,null,null,null,null,null,null,null,null,null,null,null,null,null,"（個人番号)",null,null,null,null,null,null,null,null,null,null,null,null,null,null,null,null,null,null,null,null,null,null,null,null,null,null,null,null,null,null,null,null,null,null,null,null,null,null,null,null,null,null,null,null,null,null,null,null,null,null,null,null,"左の作成シートの色が塗ってある部分に数字等を入力すると、給与支払報告書"]
[]
[]
[null,null,null,null,null,null,null,null,null,null,null,null,null,null,null,null,null,null,null,null,null,null,null,null,null,null,null,null,null,null,null,null,null,null,null,null,null,null,null,null,null,null,null,null,null,null,null,null,null,null,null,null,null,null,null,null,null,null,null,"（役職名）"]
[null,null,null,null,null,null,null,null,null,null,null,null,null,null,null,null,null,null,null,null,null,null,null,null,null,null,null,null,null,null,null,null,null,null,null,null,null,null,null,null,null,null,null,null,null,null,null,null,null,null,null,null,null,null,null,null,null,null,null,null,null,null,null,null,null,null,null,null,null,null,null,null,null,null,null,null,null,null,null,null,null,null,null,null,null,null,null,null,null,null,null,null,null,null,null,null,null,null,null,null,null,null,null,null,null,null,null,null,null,null,null,null,"（市区町村提出用）、源泉徴収票（税務署提出用）及び源泉徴収票（受給者交"]
[null,null,null,null,null,null,"を受け"]
[null,null,null,null,null,null,null,null,null,null,null,null,null,null,null,null,null,null,null,null,null,null,null,null,null,null,null,null,null,null,null,null,null,null,null,null,null,null,null,null,null,null,null,null,null,null,null,null,null,null,null,null,null,null,null,null,null,null,null,"氏名",null,null,null,"（フリガナ）"]
[]
[null,null,null,null,null,null,"る　者",null,null,null,null,null,null,null,null,null,null,null,null,null,null,null,null,null,null,null,null,null,null,null,null,null,null,null,null,null,null,null,null,null,null,null,null,null,null,null,null,null,null,null,null,null,null,null,null,null,null,null,null,null,null,null,null,null,null,null,null,null,null,null,null,null,null,null,null,null,null,null,null,null,null,null,null,null,null,null,null,null,null,null,null,null,null,null,null,null,null,null,null,null,null,null,null,null,null,null,null,null,null,null,null,null,"付用）が作成されます。"]
[]
[]
[]
{"$rows_left_out":342}
{"sheet":"Sheet2","index":1,"n_rows":30,"n_cols":12,"rows_kept":30,"cut":false,"hidden":false,"merged":[]}
[null,"課税所得","税率","控除額"]
[null,0,0.05,0,null,"配偶者控除",{"$f":"IF(Sheet1!G39=\"\",\"\",380000)","v":380000},null,null,null,"旧生命保険料控除",{"$f":"IF(Sheet1!AK58<=25000,Sheet1!AK58,IF(Sheet1!AK58<=50000,Sheet1!AK58/2+12500,IF(Sheet1!AK58<=100000,Sheet1!AK58/4+25000,50000)))","v":0}]
[null,1949000,0.1,97500,null,"老人控除配偶者",{"$f":"IF(Sheet1!Q39=\"\",\"\",100000)","v":100000},null,null,null,"旧個人年金保険料控除",{"$f":"IF(Sheet1!CJ58<=25000,Sheet1!CJ58,IF(Sheet1!CJ58<=50000,Sheet1!CJ58/2+12500,IF(Sheet1!CJ58<=100000,Sheet1!CJ58/4+25000,50000)))","v":0}]
[null,3299000,0.2,427500,null,"特定扶養",{"$f":"Sheet1!AI39*630000","v":0},null,null,null,"新生命保険料の金額",{"$f":"IF(Sheet1!T58<=20000,Sheet1!T58,IF(Sheet1!T58<=40000,Sheet1!T58/2+10000,IF(Sheet1!T58<=80000,Sheet1!T58/4+20000,40000)))","v":0}]
[null,6949000,0.23,636000,null,"同居老人扶養",{"$f":"Sheet1!AR39*100000","v":0},null,null,null,"介護医療保険料の金額",{"$f":"IF(Sheet1!BB58<=20000,Sheet1!BB58,IF(Sheet1!BB58<=40000,Sheet1!BB58/2+10000,IF(Sheet1!BB58<=80000,Sheet1!BB58/4+20000,40000)))","v":0}]
[null,8999000,0.33,1536000,null,"老人扶養",{"$f":"Sheet1!AV39*480000","v":0},null,null,null,"新個人年金保険料の金額",{"$f":"IF(Sheet1!BS58<=20000,Sheet1!BS58,IF(Sheet1!BS58<=40000,Sheet1!BS58/2+10000,IF(Sheet1!BS58<=80000,Sheet1!BS58/4+20000,40000)))","v":0}]
[null,17999000,0.4,2796000,null,"その他扶養",{"$f":"Sheet1!BE39*380000","v":0}]
[null,39999000,0.45,4796000,null,"同居特別障害",{"$f":"Sheet1!BW39*350000","v":0},null,null,null,"総生命保険料",{"$f":"IF(L15<=120000,L15,120000)","v":0}]
[null,999999999999,null,null,null,"特別障害",{"$f":"Sheet1!CC39*400000","v":0}]
[null,null,null,null,null,"その他障害",{"$f":"Sheet1!CI39*270000","v":0},null,null,null,"旧長期損害保険料の金額",{"$f":"IF(Sheet1!CJ71<=10000,Sheet1!CJ71,IF(Sheet1!CJ71<=20000,Sheet1!CJ71/2+5000,15000))","v":0}]
[null,"税額計算用１","税額計算用２",null,null,"本人特別障害",{"$f":"IF(Sheet1!AA106=\"\",\"\",400000)","v":""}]
[null,{"$f":"IF(Sheet1!AP28=\"\",\"\",IF((Sheet1!AP28-Sheet1!BI28)<1000,0,(INT((INT((Sheet1!AP28-Sheet1!BI28)/1000)*1000*VLOOKUP(INT((Sheet1!AP28-Sheet1!BI28))/1000*1000,Sheet2!$B$1:$D$9,2,TRUE)-(VLOOKUP(((Sheet1!AP28-Sheet1!BI28))/1000*1000,Sheet2!$B$1:$D$9,3,TRUE)))))-Sheet1!BX44))","v":""},null,null,null,"本人その他障害",{"$f":"IF(Sheet1!AE106=\"\",\"\",270000)","v":""},null,null,null,"生命保険料控除額",{"$f":"IF(L4=0,L2,IF((L2+L4)>40000,40000,L2+L4))","v":0}]
[null,{"$f":"IF(B12<0,0,IF(Sheet1!AP28=\"\",\"\",IF(B12=\"\",\"\",(INT(B12*1.021/100))*100)))","v":""},null,null,null,"寡婦",{"$f":"IF(Sheet1!AI106=\"\",\"\",270000)","v":""},null,null,null,"個人年金保険料控除",{"$f":"IF(L6=0,L3,IF((L3+L6)>40000,40000,L3+L6))","v":0}]
[null,null,null,null,null,"特別寡婦",{"$f":"IF(Sheet1!AM106=\"\",\"\",350000)","v":""},null,null,null,"介護医療保険料の金額",{"$f":"L5","v":0}]
[null,null,null,null,null,"寡夫",{"$f":"IF(Sheet1!AQ106=\"\",\"\",270000)","v":""},null,null,null,"合計",{"$f":"SUM(L12:L14)","v":0}]
[null,"給与所得計算用２",null,null,null,"勤労学生",{"$f":"IF(Sheet1!AU106=\"\",\"\",270000)","v":""}]
[null,{"$f":"IF(Sheet1!W28<=1618999,Sheet1!W28-650000,IF(Sheet1!W28<=1619999,969000,IF(Sheet1!W28<=1621999,970000,IF(Sheet1!W28<=1623999,972000,974000))))","v":-650000},null,null,null,"合計",{"$f":"SUM(G2:G16)","v":480000}]
[null,null,null,null,null,null,null,null,"配偶者所得","控除額"]
[null,null,null,null,null,null,null,null,0,0]
[null,null,null,null,null,null,null,null,380000,0]
{"$rows_left_out":11}
{"sheet":"Sheet3","index":2,"n_rows":0,"n_cols":0,"rows_kept":0,"cut":false,"hidden":false,"merged":[]}